model,fiscal_year,source_id,title,buyer,process,method,status,category,category_detail,supplier,original_value,current_value,change_order_count,start_date,end_date,max_end_date,tender_closing_date,tender_published_date,last_updated,doc_type,ocid,link,as_of
contract,2010-11,PM011211,Year End Audit 2010 - Tsiigehtchic,NWT Housing Corporation,Request for Proposal,Open (Competitive),Unknown,Services,Consulting Services - General,"Biswanath Chakrabarty & Co, CGA",9100.00,9100.00,0,,,,2011-02-10 15:00 MST,2018-01-24 20:31 MST,2018-01-24 20:31 MST,published,ocds-v9mmex-HC001-11-PM011211,/procurements/contract-history/ocds-v9mmex-HC001-11-PM011211/PM011211/,2024-06-19 12:15 MDT
contract,2009-10,SC530544,2009-2010 Preventative Maintenance - 7 Units,NWT Housing Corporation,Request for Tenders,Open (Competitive),Unknown,Construction,Building Construction General,Plumb Crazy Mechanical Ltd.,11550.00,11550.00,0,,,,2010-01-21 15:00 MST,2018-01-24 20:29 MST,2018-01-24 20:29 MST,published,ocds-v9mmex-HC001-10-PM009180,/procurements/contract-history/ocds-v9mmex-HC001-10-PM009180/SC530544/,2024-06-19 12:15 MDT
contract,2011-12,SC00101403,2012 Request for Financial Audit - Tsiigehtchic,NWT Housing Corporation,Request for Proposal,Open (Competitive),Unknown,Services,Financial/Accounting/Bookkeeping,"Biswanath Chakrabarty & Co, CGA",8600.00,8600.00,0,,,,2012-03-08 15:00 MST,2018-01-24 20:32 MST,2018-01-24 20:32 MST,published,ocds-v9mmex-HC001-12-PM013077,/procurements/contract-history/ocds-v9mmex-HC001-12-PM013077/SC00101403/,2024-06-19 12:15 MDT
contract,2012-13,SC530732,Preventative Maintenance,NWT Housing Corporation,Request for Tenders,Open (Competitive),Unknown,Services,Building Maintenance,Plumb Crazy Mechanical Ltd.,8010.00,8010.00,1,,,,2012-08-16 15:00 MDT,2018-01-24 20:33 MST,2018-01-24 20:33 MST,published,ocds-v9mmex-HC001-13-PM013827,/procurements/contract-history/ocds-v9mmex-HC001-13-PM013827/SC530732/,2024-06-19 12:15 MDT
contract,2016-17,0000000000000000000000178,M&I Unit Repairs Unit #24,NWT Housing Corporation,Request for Tenders,Open (Competitive),Unknown,Construction,<Not Specified>,TD&L Painting & Maintenance,81909.00,81909.00,0,,,,2016-12-13 15:00 MST,2018-01-24 20:45 MST,2018-01-24 20:45 MST,published,ocds-v9mmex-HC001-17-0000001092,/procurements/contract-history/ocds-v9mmex-HC001-17-0000001092/0000000000000000000000178/,2024-06-19 12:15 MDT
contract,2016-17,0000000000000000000000128,1/2 Ton 4x4 Crew Cab Pick-up,NWT Housing Corporation,Request for Tenders,Open (Competitive),Unknown,Goods,<Not Specified>,AURORA FORD,86252.00,86252.00,0,,,,2016-09-29 15:00 MDT,2018-01-24 20:44 MST,2018-01-24 20:44 MST,published,ocds-v9mmex-HC001-17-0000000966,/procurements/contract-history/ocds-v9mmex-HC001-17-0000000966/0000000000000000000000128/,2024-06-19 12:15 MDT
contract,2016-17,0000000000000000000000125,2016-17 Preventative Maintenance (PM) Services - T,NWT Housing Corporation,Request for Tenders,Open (Competitive),Unknown,Construction,<Not Specified>,Rocky's Plumbing & Heating Ltd.,9800.00,9800.00,0,,,,2016-10-04 15:00 MDT,2018-01-24 20:44 MST,2018-01-24 20:44 MST,published,ocds-v9mmex-HC001-17-0000000985,/procurements/contract-history/ocds-v9mmex-HC001-17-0000000985/0000000000000000000000125/,2024-06-19 12:15 MDT
contract,2016-17,0000000000000000000000122,5 Passenger 4x4 Utility Vehicle x2,NWT Housing Corporation,Request for Tenders,Open (Competitive),Unknown,Goods,<Not Specified>,AURORA FORD,59722.00,59722.00,0,,,,2016-09-27 15:00 MDT,2018-01-24 20:44 MST,2018-01-24 20:44 MST,published,ocds-v9mmex-HC001-17-0000000969,/procurements/contract-history/ocds-v9mmex-HC001-17-0000000969/0000000000000000000000122/,2024-06-19 12:15 MDT
contract,2013-14,sc530817,Preventative Maintenance - Tsiigehtchic,NWT Housing Corporation,Request for Tenders,Open (Competitive),Unknown,Construction,Building Construction General,RJ's Contracting,6400.00,6400.00,0,,,,2013-12-03 15:00 MST,2018-01-24 20:34 MST,2018-01-24 20:34 MST,published,ocds-v9mmex-HC001-14-PM015924,/procurements/contract-history/ocds-v9mmex-HC001-14-PM015924/sc530817/,2024-06-19 12:15 MDT
contract,2013-14,SC530787,Client Repair - Client # 1 - Tsiigehtchic,NWT Housing Corporation,Request for Tenders,Open (Competitive),Unknown,Construction,Building Construction General,Millennium Construction Ltd.,74000.00,74000.00,0,,,,2013-08-29 15:00 MDT,2018-01-24 20:34 MST,2018-01-24 20:34 MST,published,ocds-v9mmex-HC001-14-PM015625,/procurements/contract-history/ocds-v9mmex-HC001-14-PM015625/SC530787/,2024-06-19 12:15 MDT
contract,2013-14,SC530788,Client Repair - Client # 2 - Tsiigehtchic,NWT Housing Corporation,Request for Tenders,Open (Competitive),Unknown,Construction,Building Construction General,Millennium Construction Ltd.,77000.00,73500.00,1,,,,2013-08-29 15:00 MDT,2018-01-24 20:34 MST,2018-01-24 20:34 MST,published,ocds-v9mmex-HC001-14-PM015626,/procurements/contract-history/ocds-v9mmex-HC001-14-PM015626/SC530788/,2024-06-19 12:15 MDT
contract,2011-12,SC530677,"2011-12 Two CARE Client Repairs - Supply, Ship & Errect",NWT Housing Corporation,Request for Tenders,Open (Competitive),Unknown,Construction,Building Construction General,Millennium Construction Ltd.,22800.00,22800.00,1,,,,2011-08-04 15:00 MDT,2018-01-24 20:31 MST,2018-01-24 20:31 MST,published,ocds-v9mmex-HC001-12-PM012205,/procurements/contract-history/ocds-v9mmex-HC001-12-PM012205/SC530677/,2024-06-19 12:15 MDT
contract,2009-10,PM007856,2009 Log Cabin Move,NWT Housing Corporation,Sole Source,Direct,Unknown,Services,Labour,Red River Incorporated Band Ltd,25000.00,25000.00,0,,,,,2018-01-24 20:29 MST,2018-01-24 20:29 MST,published,ocds-v9mmex-HC001-10-PM009382,/procurements/contract-history/ocds-v9mmex-HC001-10-PM009382/PM007856/,2024-06-19 12:15 MDT
contract,2007-08,SC530373,Foundation,NWT Housing Corporation,Request for Tenders,Open (Competitive),Unknown,Construction,Building Construction General,Millennium Construction Ltd.,45500.00,45500.00,0,,,,2007-07-10 15:00 MDT,2018-01-24 20:26 MST,2018-01-24 20:26 MST,published,ocds-v9mmex-HC001-08-PM005032,/procurements/contract-history/ocds-v9mmex-HC001-08-PM005032/SC530373/,2024-06-19 12:15 MDT
contract,2021-22,HC001-0000013552,Multiple Duplex and Fourplex Modular Housing Units,NWT Housing Corporation,Request for Proposal,Open (Competitive),Unknown,Construction,<Not Specified>,Northern Industrial Construction Ltd.,14493625.86,14493625.86,0,,,,2021-07-23 15:00 MDT,2021-09-03 14:38 MDT,2021-10-06 16:16 MDT,published,ocds-v9mmex-HC001-22-0000005002,/procurements/contract-history/ocds-v9mmex-HC001-22-0000005002/HC001-0000013552/,2024-06-19 12:15 MDT
contract,2012-13,SC530716,Client Repairs - 4 Clients,NWT Housing Corporation,Request for Tenders,Open (Competitive),Unknown,Construction,Building Construction General,Millennium Construction Ltd.,128750.00,142700.00,3,,,,2012-07-05 15:00 MDT,2018-01-24 20:32 MST,2018-01-24 20:32 MST,published,ocds-v9mmex-HC001-13-PM013556,/procurements/contract-history/ocds-v9mmex-HC001-13-PM013556/SC530716/,2024-06-19 12:15 MDT
contract,2005-06,CA100846,"Supply, Ship and Erect",NWT Housing Corporation,Request for Tenders,Open (Competitive),Unknown,Construction,Building Construction General,Red River Incorporated Band Ltd,35000.00,35000.00,0,,,,2005-08-17 15:00 MDT,2018-01-24 20:23 MST,2018-01-24 20:23 MST,published,ocds-v9mmex-HC001-06-PM002181,/procurements/contract-history/ocds-v9mmex-HC001-06-PM002181/CA100846/,2024-06-19 12:15 MDT
contract,2005-06,SC530244,"Supply, Ship and Erect - Warehouse & 3 B",NWT Housing Corporation,Request for Tenders,Open (Competitive),Unknown,Construction,Building Construction General,Red River Incorporated Band Ltd,350000.00,350000.00,0,,,,2005-08-17 15:00 MDT,2018-01-24 20:23 MST,2018-01-24 20:23 MST,published,ocds-v9mmex-HC001-06-PM002181,/procurements/contract-history/ocds-v9mmex-HC001-06-PM002181/SC530244/,2024-06-19 12:15 MDT
contract,2005-06,SC530250,"Supply, Ship & Erect - Extra Material Only - Not full package",NWT Housing Corporation,Request for Tenders,Open (Competitive),Unknown,Construction,Building Construction General,Arcticrim Distributors Ltd.,21362.00,21362.00,0,,,,2005-09-09 15:00 MDT,2018-01-24 20:23 MST,2018-01-24 20:23 MST,published,ocds-v9mmex-HC001-06-PM002281,/procurements/contract-history/ocds-v9mmex-HC001-06-PM002281/SC530250/,2024-06-19 12:15 MDT
contract,2006-07,SC530299,"Supply, Ship, and Erect",NWT Housing Corporation,Request for Tenders,Open (Competitive),Unknown,Construction,Building Construction General,Dowland Contracting Ltd.,233944.00,233944.00,0,,,,2006-06-28 15:00 MDT,2018-01-24 20:24 MST,2018-01-24 20:24 MST,published,ocds-v9mmex-HC001-07-PM003367,/procurements/contract-history/ocds-v9mmex-HC001-07-PM003367/SC530299/,2024-06-19 12:15 MDT
contract,2006-07,SC530298,"Supply, Ship and Erect",NWT Housing Corporation,Request for Tenders,Open (Competitive),Unknown,Construction,Building Construction General,Blue Northern Services,225000.00,225000.00,0,,,,2006-06-28 15:00 MDT,2018-01-24 20:24 MST,2018-01-24 20:24 MST,published,ocds-v9mmex-HC001-07-PM003369,/procurements/contract-history/ocds-v9mmex-HC001-07-PM003369/SC530298/,2024-06-19 12:15 MDT
contract,2006-07,SC530296,Mechanical Room Renovations,NWT Housing Corporation,Request for Tenders,Open (Competitive),Unknown,Construction,Building Construction General,Weitzel's Construction Ltd.,35125.00,35125.00,0,,,,2006-07-05 15:00 MDT,2018-01-24 20:24 MST,2018-01-24 20:24 MST,published,ocds-v9mmex-HC001-07-PM003565,/procurements/contract-history/ocds-v9mmex-HC001-07-PM003565/SC530296/,2024-06-19 12:15 MDT
contract,2005-06,CR182712,Vehicle,NWT Housing Corporation,Request for Tenders,Open (Competitive),Unknown,Goods,Automobiles And Equipment,Kingland Ford Sales Ltd.,34761.09,34761.09,0,,,,2005-09-28 15:00 MDT,2018-01-24 20:24 MST,2018-01-24 20:24 MST,published,ocds-v9mmex-HC001-06-PM003206,/procurements/contract-history/ocds-v9mmex-HC001-06-PM003206/CR182712/,2024-06-19 12:15 MDT
contract,2005-06,SC530250,"Supply, Ship & Erect - Extra Material Only - Not Full Package",NWT Housing Corporation,Request for Tenders,Open (Competitive),Unknown,Construction,Building Construction General,Arcticrim Distributors Ltd.,21362.00,21362.00,0,,,,2005-09-09 15:00 MDT,2018-01-24 20:24 MST,2018-01-24 20:24 MST,published,ocds-v9mmex-HC001-06-PM003210,/procurements/contract-history/ocds-v9mmex-HC001-06-PM003210/SC530250/,2024-06-19 12:15 MDT
contract,2005-06,SC530243,Pile Tender,NWT Housing Corporation,Request for Tenders,Open (Competitive),Unknown,Construction,Building Construction General,Mackenzie Valley Construction Ltd.,21000.00,21000.00,0,,,,2005-08-12 15:00 MDT,2018-01-24 20:24 MST,2018-01-24 20:24 MST,published,ocds-v9mmex-HC001-06-PM003211,/procurements/contract-history/ocds-v9mmex-HC001-06-PM003211/SC530243/,2024-06-19 12:15 MDT
contract,2005-06,CR182707,Building Material,NWT Housing Corporation,Sole Source,Direct,Unknown,Construction,Building Construction General,Arcticrim Distributors Ltd.,28363.33,28363.33,0,,,,,2018-01-24 20:24 MST,2018-01-24 20:24 MST,published,ocds-v9mmex-HC001-06-PM003213,/procurements/contract-history/ocds-v9mmex-HC001-06-PM003213/CR182707/,2024-06-19 12:15 MDT
contract,2005-06,SC530263,"Supply, Ship and Erect",NWT Housing Corporation,Request for Tenders,Open (Competitive),Unknown,Construction,Building Construction General,Weitzel's Construction Ltd.,82676.00,82676.00,0,,,,2006-01-06 15:00 MST,2018-01-24 20:23 MST,2018-01-24 20:23 MST,published,ocds-v9mmex-HC001-06-PM002601,/procurements/contract-history/ocds-v9mmex-HC001-06-PM002601/SC530263/,2024-06-19 12:15 MDT
contract,2005-06,SC 530237,Labour Only,NWT Housing Corporation,Request for Tenders,Open (Competitive),Unknown,Construction,Building Construction General,Mackenzie Valley Construction Ltd.,15000.00,15000.00,0,,,,2005-06-27 15:00 MDT,2018-01-24 20:23 MST,2018-01-24 20:23 MST,published,ocds-v9mmex-HC001-06-PM002014,/procurements/contract-history/ocds-v9mmex-HC001-06-PM002014/SC-530237/,2024-06-19 12:15 MDT
contract,2014-15,sc441255,3 Client Repairs - Tsiigehtchic,NWT Housing Corporation,Request for Tenders,Open (Competitive),Unknown,Construction,Building Construction General,petes contracting,5400.00,5750.00,1,,,,2014-11-18 15:00 MST,2018-01-24 20:35 MST,2018-01-24 20:35 MST,published,ocds-v9mmex-HC001-15-PM016893,/procurements/contract-history/ocds-v9mmex-HC001-15-PM016893/sc441255/,2024-06-19 12:15 MDT
contract,2014-15,sc530838,1 Client Repair - Tssigehtchic,NWT Housing Corporation,Request for Tenders,Open (Competitive),Unknown,Construction,Building Construction General,Beaulieu Contracting ltd,75000.00,75000.00,0,,,,2014-06-19 15:00 MDT,2018-01-24 20:35 MST,2018-01-24 20:35 MST,published,ocds-v9mmex-HC001-15-PM016914,/procurements/contract-history/ocds-v9mmex-HC001-15-PM016914/sc530838/,2024-06-19 12:15 MDT
contract,2014-15,sc530841,1 Safe Client Repair - Tsiigehtchic,NWT Housing Corporation,Request for Tenders,Open (Competitive),Unknown,Construction,Building Construction General,Plumb Crazy Mechanical Ltd.,7908.00,7908.00,0,,,,2014-07-09 15:00 MDT,2018-01-24 20:35 MST,2018-01-24 20:35 MST,published,ocds-v9mmex-HC001-15-PM016916,/procurements/contract-history/ocds-v9mmex-HC001-15-PM016916/sc530841/,2024-06-19 12:15 MDT
contract,2011-12,SC530647,2011-12 One Care Client - Fuel Tank & Deck Renovation SS & E,NWT Housing Corporation,Request for Tenders,Open (Competitive),Unknown,Construction,Building Construction General,Millennium Construction Ltd.,18400.00,19100.00,1,,,,2011-04-27 15:00 MDT,2018-01-24 20:31 MST,2018-01-24 20:31 MST,published,ocds-v9mmex-HC001-12-PM011662,/procurements/contract-history/ocds-v9mmex-HC001-12-PM011662/SC530647/,2024-06-19 12:15 MDT
contract,2011-12,SC530648,2011-12 One Care Client - Insullation & Heating System Renovation - SS & E,NWT Housing Corporation,Request for Tenders,Open (Competitive),Unknown,Construction,Building Construction General,Millennium Construction Ltd.,32300.00,35580.00,1,,,,2011-04-27 15:00 MDT,2018-01-24 20:31 MST,2018-01-24 20:31 MST,published,ocds-v9mmex-HC001-12-PM011663,/procurements/contract-history/ocds-v9mmex-HC001-12-PM011663/SC530648/,2024-06-19 12:15 MDT
contract,2010-11,SC530588,"2010-11 Two CARE Clients - Supply, Ship & Errect FOB Tsiigehtchic",NWT Housing Corporation,Request for Tenders,Open (Competitive),Unknown,Construction,Building Construction General,Weitzel's Construction Ltd.,28370.00,34170.00,1,,,,2010-07-08 15:00 MDT,2018-01-24 20:30 MST,2018-01-24 20:30 MST,published,ocds-v9mmex-HC001-11-PM010104,/procurements/contract-history/ocds-v9mmex-HC001-11-PM010104/SC530588/,2024-06-19 12:15 MDT
contract,2009-10,SC530522,"2009/2010 Two-Bedroom House Renovation, Supply, Ship & Erect",NWT Housing Corporation,Request for Tenders,Open (Competitive),Unknown,Construction,Building Construction General,Weitzel's Construction Ltd.,57800.00,60300.00,1,,,,2009-09-03 15:00 MDT,2018-01-24 20:28 MST,2018-01-24 20:28 MST,published,ocds-v9mmex-HC001-10-PM008390,/procurements/contract-history/ocds-v9mmex-HC001-10-PM008390/SC530522/,2024-06-19 12:15 MDT
contract,2008-09,SC530449,New Construction Duplex Tsiigehtchic,NWT Housing Corporation,Negotiated,Direct,Unknown,Construction,Building Construction General,PC Construction Ltd.,506400.00,506400.00,0,,,,,2018-01-24 20:28 MST,2018-01-24 20:28 MST,published,ocds-v9mmex-HC001-09-PM008517,/procurements/contract-history/ocds-v9mmex-HC001-09-PM008517/SC530449/,2024-06-19 12:15 MDT
contract,2007-08,SC530410,"Supply, Ship and Erect",NWT Housing Corporation,Request for Tenders,Open (Competitive),Unknown,Construction,Building Construction General,Weitzel's Construction Ltd.,39750.00,39750.00,0,,,,2008-02-19 15:00 MST,2018-01-24 20:26 MST,2018-01-24 20:26 MST,published,ocds-v9mmex-HC001-08-PM005910,/procurements/contract-history/ocds-v9mmex-HC001-08-PM005910/SC530410/,2024-06-19 12:15 MDT
contract,2008-09,SC530445,Preventative Maintenance,NWT Housing Corporation,Request for Tenders,Open (Competitive),Unknown,Services,Building Maintenance,Plumb Crazy Mechanical Ltd.,5850.00,5850.00,0,,,,2008-07-31 15:00 MDT,2018-01-24 20:27 MST,2018-01-24 20:27 MST,published,ocds-v9mmex-HC001-09-PM006633,/procurements/contract-history/ocds-v9mmex-HC001-09-PM006633/SC530445/,2024-06-19 12:15 MDT
contract,2007-08,SC530404,Renovations,NWT Housing Corporation,Request for Tenders,Open (Competitive),Unknown,Construction,Building Construction General,PC Construction Ltd.,33300.00,33300.00,0,,,,2007-11-29 15:00 MST,2018-01-24 20:26 MST,2018-01-24 20:26 MST,published,ocds-v9mmex-HC001-08-PM005644,/procurements/contract-history/ocds-v9mmex-HC001-08-PM005644/SC530404/,2024-06-19 12:15 MDT
contract,2007-08,SC530407,Renovations,NWT Housing Corporation,Request for Tenders,Open (Competitive),Unknown,Construction,Building Construction General,984339 NWT Ltd. o/a Arctic Bui,25555.00,25555.00,0,,,,2007-12-11 15:00 MST,2018-01-24 20:26 MST,2018-01-24 20:26 MST,published,ocds-v9mmex-HC001-08-PM005704,/procurements/contract-history/ocds-v9mmex-HC001-08-PM005704/SC530407/,2024-06-19 12:15 MDT
contract,2008-09,SC530423,Supply Ship & Erect,NWT Housing Corporation,Request for Tenders,Open (Competitive),Unknown,Construction,Building Construction General,Mackenzie Valley Construction Ltd.,44700.00,44700.00,0,,,,2008-04-15 15:00 MDT,2018-01-24 20:27 MST,2018-01-24 20:27 MST,published,ocds-v9mmex-HC001-09-PM006196,/procurements/contract-history/ocds-v9mmex-HC001-09-PM006196/SC530423/,2024-06-19 12:15 MDT
contract,2007-08,SC5303666,New Construction,NWT Housing Corporation,Negotiated,Direct,Unknown,Construction,Building Construction General,PC Construction Ltd.,298000.00,298000.00,0,,,,,2018-01-24 20:26 MST,2018-01-24 20:26 MST,published,ocds-v9mmex-HC001-08-PM005185,/procurements/contract-history/ocds-v9mmex-HC001-08-PM005185/SC5303666/,2024-06-19 12:15 MDT
contract,2007-08,SC530365,New Construction,NWT Housing Corporation,Request for Tenders,Open (Competitive),Unknown,Construction,Building Construction General,PC Construction Ltd.,633150.00,633150.00,0,,,,2007-05-24 15:00 MDT,2018-01-24 20:26 MST,2018-01-24 20:26 MST,published,ocds-v9mmex-HC001-08-PM005186,/procurements/contract-history/ocds-v9mmex-HC001-08-PM005186/SC530365/,2024-06-19 12:15 MDT
contract,2007-08,SC530373,"Supply, Ship and Erect",NWT Housing Corporation,Request for Tenders,Open (Competitive),Unknown,Construction,Building Construction General,Millennium Construction Ltd.,45500.00,45500.00,0,,,,2007-07-10 15:00 MDT,2018-01-24 20:26 MST,2018-01-24 20:26 MST,published,ocds-v9mmex-HC001-08-PM005195,/procurements/contract-history/ocds-v9mmex-HC001-08-PM005195/SC530373/,2024-06-19 12:15 MDT
contract,2007-08,SC530385,Preventative Maintenance,NWT Housing Corporation,Request for Tenders,Open (Competitive),Unknown,Services,Maintenance Management Consulting,Weitzel's Construction Ltd.,5310.00,5310.00,0,,,,2007-08-28 15:00 MDT,2018-01-24 20:26 MST,2018-01-24 20:26 MST,published,ocds-v9mmex-HC001-08-PM005309,/procurements/contract-history/ocds-v9mmex-HC001-08-PM005309/SC530385/,2024-06-19 12:15 MDT
contract,2017-18,0000000000000000000000309,1 Unit M&I - Unit 17,NWT Housing Corporation,Request for Tenders,Open (Competitive),Unknown,Construction,<Not Specified>,TD&L Painting & Maintenance,67760.00,67760.00,0,,,,2017-06-08 15:00 MDT,2018-01-24 20:45 MST,2018-01-24 20:45 MST,published,ocds-v9mmex-HC001-18-0000001517,/procurements/contract-history/ocds-v9mmex-HC001-18-0000001517/0000000000000000000000309/,2024-06-19 12:15 MDT
